2019-08-26 19:17 AEST

View Issue Details Jump to Notes ]
IDProjectCategoryView StatusLast Update
0000178mercuryBugpublic2011-01-12 14:55
Reporterpbone 
Assigned To 
PrioritylowSeveritytweakReproducibilityalways
StatusnewResolutionopen 
Product Version 
Target VersionFixed in Version 
Summary0000178: browser/browser_test.m does not compile.
Description
Executing 'mmake all' in the browser directory fails to compile browser_test.m
It loos as though browser_test.m is out of date.
Additional Information/home/taura/public/mercury-latest/x86_64-unknown-linux-gnu/bin/mmc --compile-to-c --grade asm_fast.gc.decldebug --profile-for-implicit-parallelism -R/home/taura/workspaces/pbone/par_test.install/lib/mercury/lib/asm_fast.gc.decldebug -R/home/taura/workspaces/pbone/par_test.install/lib/mercury/lib --flags MDB_FLAGS browse_test > browse_test.err 2>&1
make: *** [browse_test.c_date] Error 1

pbone@taura:/home/taura/workspaces/pbone/par_test/browser$ less browse_test.err
browse_test.m:049: In clause for predicate `main'/2:
browse_test.m:049: error: undefined predicate `browse.browse'/8.
browse_test.m:052: In clause for predicate `main'/2:
browse_test.m:052: error: undefined predicate `browse.browse'/8.
browse_test.m:055: In clause for predicate `main'/2:
browse_test.m:055: error: undefined predicate `browse.browse'/8.
TagsNo tags attached.
Attached Files

-Relationships
+Relationships

-Notes
There are no notes attached to this issue.
+Notes

-Issue History
Date Modified Username Field Change
2011-01-12 14:55 pbone New Issue
+Issue History