2017-12-11 16:37 AEDT

View Issue Details Jump to Notes ]
IDProjectCategoryView StatusLast Update
0000409mercuryBugpublic2016-06-16 13:04
Reporterwangp 
Assigned To 
PrioritynormalSeverityminorReproducibilityhave not tried
StatusnewResolutionopen 
Product Version 
Target VersionFixed in Version 
Summary0000409: functor_ho_inst failing on 32-bit
DescriptionThis was on Solaris/x86 but I assume it would affect any 32-bit platform.

FAILED TEST hard_coded/functor_ho_inst in grade asm_fast.gc
FAILED TEST hard_coded/functor_ho_inst_2 in grade asm_fast.gc
FAILED TEST hard_coded/functor_ho_inst_excp in grade asm_fast.gc
FAILED TEST hard_coded/functor_ho_inst_excp_2 in grade asm_fast.gc

Uncaught Mercury exception:
Software Error: transform_hlds.float_regs: predicate `transform_hlds.float_regs.lookup_pred_inst_info'/5: Unexpected: no higher order inst
TagsNo tags attached.
Attached Files

-Relationships
+Relationships

-Notes
There are no notes attached to this issue.
+Notes

-Issue History
Date Modified Username Field Change
2016-06-16 13:04 wangp New Issue
+Issue History